ACADEMIC
type: Concept

UNC-CHAPEL_HILL/ILS/MRC
type: Concept
change note: 2012-06-22 13:05:48.0 [tbs1979] insert AltLabel (id: null text: METADATA RESEARCH CENTER, SCHOOL OF INFORMATION AND LIBRARY SCIENCES, UNIVERSITY OF NORTH CAROLINA AT CHAPEL HILL language code: en);
change note: 2012-06-22 13:05:13.0 [tbs1979] Insert Concept add broader relation (UNC-CHAPEL_HILL/ILS/MRC [e1a5d303-8fe9-461c-93e7-c71a031d1136,39639] - ACADEMIC [7700280b-68ee-4644-bf5e-84e7a6adf897,24357]);
definition: The University of North Carolina (UNC) School of Information and Library Science (SILS) Metadata Research Center (MRC) has been established to advance research in metadata, semantics, and ontologies. Current (MRC) research initiatives target digital data, data-at-risk, and knowledge organization via leadership and engagement in Dryad, two HIVE datanet collaborations, the DCMI Science & Metadata Community, the DataONE/Preservation & Metadata Working Group, and the CODATA/Data-at-Risk Working Group.
in scheme: providers