Beidou
type: Concept
alternative label: Compass
change note: 2017-08-15 09:28:44.0 [tstevens] insert Definition (id: null text: The BeiDou Navigation Satellite System will provide global coverage with positioning, navigation and timing services, including two kinds of service modes: an open service and an authorized service. The open service is provided free of charge location, velocity and timing, with positioning accuracy of 10 meters, velocity accuracy of 0.2 meters / second and timing accuracy of 10 nanoseconds. The authorized service provides a more secure position, velocity, timing, and communications services as well as a higher level of integrity. In order to make BeiDou Navigation Satellite System work better for global service, strengthen compatibility and interoperability between BeiDou and other countries’satellite navigation systems,and promote satellite positioning, navigation and timing service application, China is willing to cooperate with other countries in developing satellite navigation industry. language code: en);
change note: 2017-08-14 15:26:01.0 [tstevens] insert AltLabel (id: null category: null text: Compass language code: en);
change note: 2017-08-14 15:22:02.0 [tstevens] Insert Concept add broader relation (Beidou [b4306421-a1b1-4d56-ad84-6f0c57806369,309907] - Beidou (China’s Satellite Navigation System) [ef679d6a-a05b-4976-a236-ce2158b758ea,309903]);
change note: 2017-08-14 15:22:22.0 [tstevens] insert AltLabel (id: null category: primary text: Beidou Satellites language code: en);
definition: The BeiDou Navigation Satellite System will provide global coverage with positioning, navigation and timing services, including two kinds of service modes: an open service and an authorized service. The open service is provided free of charge location, velocity and timing, with positioning accuracy of 10 meters, velocity accuracy of 0.2 meters / second and timing accuracy of 10 nanoseconds. The authorized service provides a more secure position, velocity, timing, and communications services as well as a higher level of integrity. In order to make BeiDou Navigation Satellite System work better for global service, strengthen compatibility and interoperability between BeiDou and other countries’satellite navigation systems,and promote satellite positioning, navigation and timing service application, China is willing to cooperate with other countries in developing satellite navigation industry.
in scheme: platforms

Beidou (China's Satellite Navigation System)
type: Concept