A - C
type: Concept

CMGOOS
type: Concept
definition: GOOS is a permanent global system for observations, modelling and analysis of marine and ocean variables to support operational ocean services worldwide. GOOS provides accurate descriptions of the present state of the oceans, including living resources; continuous forecasts of the future conditions of the sea for as far ahead as possible, and the basis for forecasts of climate change. Information provided by http://www.ioc-goos.org/content/view/12/26/
in scheme: projects