CONSORTIA/INSTITUTIONS
type: Concept

Arcticdata
type: Concept
change note: 2017-10-06 09:30:59.0 [tstevens] insert Definition (id: null text: The NSF Arctic Data Center will help the research community reproducibly preserve and discover all products of NSF-funded science in the Arctic, including data, metadata, software, documents, and provenance that link these in a coherent knowledge model. Key to the initiative is the partnership between NCEAS at UC Santa Barbara, DataONE, and NOAA’s NCEI, each of which bring critical capabilities to the Center. Infrastructure from the successful NSF-sponsored DataONE federation of data repositories will enable data replication to NCEI, providing both offsite and institutional diversity that is critical to long term preservation. language code: en);
change note: 2017-10-06 09:30:16.0 [tstevens] insert AltLabel (id: null category: primary text: Arctic Data Center language code: en);
change note: 2017-10-06 09:28:55.0 [tstevens] Insert Concept add broader relation (Arcticdata [b5763810-b724-4b7b-a3f8-7bd024e612cc,310229] - CONSORTIA/INSTITUTIONS [aef2fc80-def0-46a4-9259-9dc37e80ed08,280053]);
definition: The NSF Arctic Data Center will help the research community reproducibly preserve and discover all products of NSF-funded science in the Arctic, including data, metadata, software, documents, and provenance that link these in a coherent knowledge model. Key to the initiative is the partnership between NCEAS at UC Santa Barbara, DataONE, and NOAA’s NCEI, each of which bring critical capabilities to the Center. Infrastructure from the successful NSF-sponsored DataONE federation of data repositories will enable data replication to NCEI, providing both offsite and institutional diversity that is critical to long term preservation.
in scheme: providers