GFOE
type: Concept
change note: 2020-07-24 09:23:58.0 [tstevens] Insert Concept add broader relation (GFOE [b8cde239-ead4-44bd-9625-34bd6b34398f,560566] - NON-GOVERNMENT/NON-PROFIT ORGANIZATIONS [f8762581-b92f-48f9-b077-964ee6b0c8ee,533829]);
change note: 2020-07-24 09:27:51.0 [tstevens] insert AltLabel (id: null category: primary text: Global Foundation for Ocean Exploration language code: en); insert Definition (id: null text: The mission of the Global Foundation for Ocean Exploration (GFOE) is to develop the capabilities and foster the relationships necessary to be a global presence in the world of ocean exploration, as well as an international resource for our partners. Through our work in the deep sea, we help society to understand, interpret and protect this critical ocean environment. We empower the underwater science community with the tools and expertise required to explore the greatest depths of the planet’s largest and deepest bodies of water. GFOE trains the ocean exploration workforce, not only for the national ocean exploration program, but for the community at large. We identify and develop career paths for young engineers that allow them to experience an end-to-end process of undersea technology design through application. We are also committed to supporting filmmakers who can tell the stories of our ocean, helping to increase public awareness and appreciation of the underwater environment. GFOE is a 501c3 non-profit organization headquartered in Mystic, CT on the grounds of Mystic Seaport. language code: en); insert Resource (id: null type: provider url: https://engineeringfordiscovery.org/);
definition: The mission of the Global Foundation for Ocean Exploration (GFOE) is to develop the capabilities and foster the relationships necessary to be a global presence in the world of ocean exploration, as well as an international resource for our partners. Through our work in the deep sea, we help society to understand, interpret and protect this critical ocean environment. We empower the underwater science community with the tools and expertise required to explore the greatest depths of the planet’s largest and deepest bodies of water. GFOE trains the ocean exploration workforce, not only for the national ocean exploration program, but for the community at large. We identify and develop career paths for young engineers that allow them to experience an end-to-end process of undersea technology design through application. We are also committed to supporting filmmakers who can tell the stories of our ocean, helping to increase public awareness and appreciation of the underwater environment. GFOE is a 501c3 non-profit organization headquartered in Mystic, CT on the grounds of Mystic Seaport.
in scheme: providers

NON-GOVERNMENT/NON-PROFIT ORGANIZATIONS
type: Concept