Infrared Pyrometers
type: Concept

KT19 Pyrometer
type: Concept
change note: 2015-06-19 13:51:42.0 [aaleman] added new instrument per NSIDC request insert AltLabel (id: null text: Heitronics KT19 Infrared Radiation Pyrometer language code: en);
change note: 2020-09-01 08:22:47.0 [tstevens] update AltLabel (Heitronics KT19 Infrared Pyrometer); insert Definition (id: null text: The KT19 II implements the most advanced infrared technologyof the forthcoming generation. New performance features bringadded functionality beneficial to difficult and complex appli-cations. The KT19 II sets unsurpassed standards inradiation pyrometry. It is the ultimate high per-former for non-contact temperature measurements to cope with extremelyunfavorable boundary conditions.The magnitude of availableoptions and freelyselectable operatingparameters allowsideal adaptation forthe specific require-ments of all feasibleapplications. language code: en);
change note: 2015-06-19 13:51:03.0 [aaleman] Insert Concept add broader relation (KT19 Pyrometer [b8e1857c-ea38-4341-a01b-2879e63ac2d8,158043] - Infrared Pyrometers [9669f608-8f98-46d3-a74e-6b9750d3e5e7,158039]);
definition: The KT19 II implements the most advanced infrared technologyof the forthcoming generation. New performance features bringadded functionality beneficial to difficult and complex appli-cations. The KT19 II sets unsurpassed standards inradiation pyrometry. It is the ultimate high per-former for non-contact temperature measurements to cope with extremelyunfavorable boundary conditions.The magnitude of availableoptions and freelyselectable operatingparameters allowsideal adaptation forthe specific require-ments of all feasibleapplications.
in scheme: instruments