FEED CONTAMINATION AND TOXICOLOGY
type: Concept
definition: Any measure related to the contamination and toxicology of feed by microorganisms, pathogens, viruses, weeds, etc...
in scheme: sciencekeywords

FEED PRODUCTS
type: Concept