COMMERCIAL
type: Concept

DCI/DC
type: Concept
definition: Discovery Channel online lets you explore science, history, space, tech, sharks, & more, with videos & news, plus exclusives on your favorite TV shows. Summary provided by http://dsc.discovery.com/
in scheme: providers