Spectrometers
type: Concept

SAGE III
type: Concept
change note: 2019-05-31 13:07:40.0 [sritz] update Definition (SAGE III is a fourth generation, satellite-borne instrument and a crucial element in NASA's Earth Observing System (EOS). Its mission is to enhance our understanding of natural and human-derived atmospheric processes by providing accurate long-term measurements of the vertical structure of aerosols, ozone, water vapor, and other important trace gases in the upper troposphere and stratosphere. Group: Instrument_Details Entry_ID: SAGE III Group: Instrument_Identification Instrument_Category: Earth Remote Sensing Instruments Instrument_Class: Passive Remote Sensing Instrument_Type: Spectrometers/Radiometers Instrument_Subtype: Spectrometers Short_Name: SAGE III Long_Name: Stratospheric Aerosol and Gas Experiment III End_Group Group: Associated_Platforms Short_Name: METEOR-3M End_Group Online_Resource: https://sage.larc.nasa.gov/ Creation_Date: 2009-02-27 Group: Instrument_Logistics Instrument_Owner: USA/NASA End_Group End_Group);
change note: 2019-05-31 13:05:04.0 [sritz] update Definition (SAGE III is a fourth generation, satellite-borne instrument and a crucial element in NASA's Earth Observing System (EOS). Its mission is to enhance our understanding of natural and human-derived atmospheric processes by providing accurate long-term measurements of the vertical structure of aerosols, ozone, water vapor, and other important trace gases in the upper troposphere and stratosphere. Group: Instrument_Details Entry_ID: SAGE III Group: Instrument_Identification Instrument_Category: Earth Remote Sensing Instruments Instrument_Class: Passive Remote Sensing Instrument_Type: Spectrometers/Radiometers Instrument_Subtype: Spectrometers Short_Name: SAGE III Long_Name: Stratospheric Aerosol and Gas Experiment III End_Group Group: Associated_Platforms Short_Name: METEOR-3M End_Group Online_Resource: https://nasascience.nasa.gov/missions/sage-3 Online_Resource: https://oea.larc.nasa.gov/PAIS/SAGE3.html Creation_Date: 2009-02-27 Group: Instrument_Logistics Instrument_Owner: USA/NASA End_Group End_Group); insert WeightedRelation (id: null related concept uuid: 5a326a88-e23a-42c3-967a-7150bbf2acda relationship type: null relationship value: null generated by: null);
definition: SAGE III is a fourth generation, satellite-borne instrument and a crucial element in NASA's Earth Observing System (EOS). Its mission is to enhance our understanding of natural and human-derived atmospheric processes by providing accurate long-term measurements of the vertical structure of aerosols, ozone, water vapor, and other important trace gases in the upper troposphere and stratosphere. Group: Instrument_Details Entry_ID: SAGE III Group: Instrument_Identification Instrument_Category: Earth Remote Sensing Instruments Instrument_Class: Passive Remote Sensing Instrument_Type: Spectrometers/Radiometers Instrument_Subtype: Spectrometers Short_Name: SAGE III Long_Name: Stratospheric Aerosol and Gas Experiment III End_Group Group: Associated_Platforms Short_Name: METEOR-3M End_Group Online_Resource: https://sage.larc.nasa.gov/ Creation_Date: 2009-02-27 Group: Instrument_Logistics Instrument_Owner: USA/NASA End_Group End_Group
in scheme: instruments