Spectrometers
type: Concept

MAMS
type: Concept
definition: MAMS is a multispectral scanner which measures reflected radiation from the Earth's surface and clouds in eight visible/near-infrared bands, and thermal emission from the Earth's surface, clouds, and atmospheric constituents (primarily water vapor) in four infrared bands. The 5.0 mRa aperture of MAMS produces an instantaneous field-of-view (IFOV) resolution of 100 m at nadir from the nominal ER-2 altitude of 20 km. The width of the entire cross path field-of-view scanned by the sensor is 37 km, thereby providing detailed resolution of atmospheric and surface features across the swath width and along the aircraft flight track. For clouds and thunderstorm features the IFOV decreases with increasing cloud height by a factor of (Z-20)/20, where Z is the cloud height in kilometers. The MAMS 6.5 micrometer channel has been used to map variations in upper tropospheric water vapor associated with a variety of atmospheric disturbances. The upper tropospheric water vapor imagery from VAS and the new GOES imager and sounder is very useful in the study of upper-level dynamics of mid-latitude weather systems. This is readily apparent in video "loops" of this from the satellite channel, which show smooth flowing patterns associated with large-scale weather disturbances. Changes in the brightness of the water vapor features are related to the vertical distribution of water vapor in the middle and upper troposphere, the integrated water vapor amount, and to a lesser degree the temperature profile. In addition, water vapor imagery can be used to discern small-scale variability of high clouds (particularly cirrus) and clear air atmospheric water vapor fields. In particular, MAMS water vapor imagery has been used to map clear air moisture variations in a number of different applications including lee wave situations. The split-window channels from MAMS are similar to those from the Advanced Very High Resolution Radiometer (AVHRR), VAS, and GOES-8/9/10 imager and sounder. The 11 microm…
in scheme: instruments