ANIMALS/INVERTEBRATES
type: Concept

PHORONIDS
type: Concept
change note: 2017-03-13 14:18:14.0 [mgenazzi] Definition added insert Definition (id: null text: Phylum Phoronida. Commonly called Horeshoe worms are hermaphroditic, marine, benthic, suspension feeding vermiform animals distringuished with a looped digestive tract and the anus is located close to the mouth. Adult Phoronida live in chitinous tube attached or burrowed in a hard substrate with lophophore, ciliated feeding structure, surrounding the mouth. language code: en);
definition: Phylum Phoronida. Commonly called Horeshoe worms are hermaphroditic, marine, benthic, suspension feeding vermiform animals distringuished with a looped digestive tract and the anus is located close to the mouth. Adult Phoronida live in chitinous tube attached or burrowed in a hard substrate with lophophore, ciliated feeding structure, surrounding the mouth.
in scheme: sciencekeywords