DOD
type: Concept

DOD/USARMY/USACE/WES
type: Concept
definition: The Waterways Experiment Station (WES) is headquarters for the U.S. Army Engineer Research and Development Center (ERDC). Part of the Department of Defense laboratory system, the ERDC has as its mission to conceive, plan, study and execute engineering investigations and research and development studies in support of the civil and military missions of the Corps of Engineers and other federal agencies. Website: "http://www.wes.army.mil/" [Summary provided by the U.S. Army Corps of Engineers]
in scheme: providers