HEAT
type: Concept
change note: 2012-07-02 09:23:09.0 [tbs1979] insert Definition (id: null text: Hot weather, which may be accompanied by high humidity language code: en);
change note: 2012-06-27 14:59:11.0 [tbs1979] Insert Concept add broader relation (HEAT [bb9c9be6-78c7-4fbd-9a35-a218276393ec,40241] - NATURAL HAZARDS [ec0e2762-f57a-4fdc-b395-c8d7d5590d18,21253]);
definition: Hot weather, which may be accompanied by high humidity
in scheme: sciencekeywords

NATURAL HAZARDS
type: Concept