SC/DNR
type: Concept

SCDNR
type: Concept
definition: South Carolina Department of Natural Resources's vision for South Carolina is an enhanced quality of life for present and future generations through improved understanding, wise use, and safe enjoyment of healthy, diverse, sustainable and accessible natural resources. Our vision for the DNR is to be a trusted and respected leader in natural resources protection and management, by consistently making wise and balanced decisions for the benefit of the state’s natural resources and its people.
in scheme: providers