SBAS
type: Concept

GNSS RECEIVER
type: Concept
change note: 2021-08-05 12:10:37.0 [sritz] insert AltLabel (id: null category: primary text: GNSS RECEIVER language code: en);
change note: 2017-08-15 10:58:20.0 [tstevens] insert Definition (id: null text: GNSS receivers detect, decode, and process signals from the GNSS satellites. The satellites transmit the ranging codes on two radio-frequency carriers, allowing the locations of GNSS receivers to be determined with varying degrees of accuracy, depending on the receiver and post-processing of the data. language code: en);
change note: 2017-08-14 15:50:48.0 [tstevens] Insert Concept add broader relation (GNSS RECEIVER [be02e58f-ce2f-448f-8a81-74bcc4eb7056,310039] - SBAS [50731a19-972c-4337-b964-378d623f3c03,310035]);
definition: GNSS receivers detect, decode, and process signals from the GNSS satellites. The satellites transmit the ranging codes on two radio-frequency carriers, allowing the locations of GNSS receivers to be determined with varying degrees of accuracy, depending on the receiver and post-processing of the data.
in scheme: instruments