NASA
type: Concept

NASA/MSFC/GHRC/DISCOVER
type: Concept
change note: 2017-06-12 14:35:03.0 [sritz] update Definition (DISCOVER is a NASA Earth Science REASoN project. REASoN (Research, Education and Applications Solution Network) is a distributed network of data and information providers for NASA's Earth Science Enterprise (ESE) Science, Applications and Education programs. NASA REASoN DISCOVER core mission: provide highly accurate, long-term climate data records and near-real-time ocean products suitable for the most demanding Earth research applications via easy-to-use display and data access tools.); update Definition (https://ghrc.nsstc.nasa.gov/home/projects/discover);
change note: 2017-06-12 14:36:09.0 [sritz] update Definition (The Distributed Information Services for Climate and Ocean Products and Visualizations for Earth Research (DISCOVER) is a NASA Earth Science MEaSUREs project. MEaSUREs supports the NASA Earth Science research community in providing Earth science data products and services driven by NASA’s Earth Science goals. The major objective of DISCOVER is to provide highly accurate, multi-decadal geophysical products derived from satellite microwave sensors. These products are suitable for some of the most demanding Earth research applications and are available via easy-to-use display and data access tools. Most of the products are generated in near real-time, so they also are suitable for some weather applications and field campaigns.);
definition: The Distributed Information Services for Climate and Ocean Products and Visualizations for Earth Research (DISCOVER) is a NASA Earth Science MEaSUREs project. MEaSUREs supports the NASA Earth Science research community in providing Earth science data products and services driven by NASA’s Earth Science goals. The major objective of DISCOVER is to provide highly accurate, multi-decadal geophysical products derived from satellite microwave sensors. These products are suitable for some of the most demanding Earth research applications and are available via easy-to-use display and data access tools. Most of the products are generated in near real-time, so they also are suitable for some weather applications and field campaigns.
in scheme: providers