ATMOSPHERIC RADIATION
type: Concept

AIRGLOW
type: Concept
definition: A faint luminescence of the night sky originating in photochemical reactions in the upper atmosphere. Also referred to as geocoronal emission.
in scheme: sciencekeywords