Earth Observation Satellites
type: Concept

EarthCARE
type: Concept
change note: 2020-10-06 08:12:47.0 [mmorahan] insert AltLabel (id: null category: primary text: Earth Clouds, Aerosol and Radiation Explorer language code: en);
change note: 2019-02-15 11:06:54.0 [mmorahan] insert WeightedRelation (id: null related concept uuid: 485824e1-c539-45e6-8262-4e902b8542ed relationship type: null relationship value: null generated by: null); insert WeightedRelation (id: null related concept uuid: f3c9a235-939d-4898-94f3-3dea5ad187e1 relationship type: null relationship value: null generated by: null); insert WeightedRelation (id: null related concept uuid: 715d7cf7-0824-4fca-bdd8-1b651953b820 relationship type: null relationship value: null generated by: null); insert WeightedRelation (id: null related concept uuid: 081f9b6e-d0a0-4f1d-ad8a-638189418480 relationship type: null relationship value: null generated by: null);
change note: 2018-06-12 06:15:03.0 [mmorahan] Insert Concept add broader relation (EarthCARE [bf66ef8c-acc5-4c2f-b519-db0cbee37c99,367671] - Earth Observation Satellites [3466eed1-2fbb-49bf-ab0b-dc08731d502b,344761]);
change note: 2018-06-12 06:17:34.0 [mmorahan] insert Definition (id: null text: The EarthCARE satellite will carry four instruments for observations of clouds and aerosols with four synergistic sensing methodologies. The three-axis stabilised satellite platform was designed to accommodate the four instruments, which need unobstructed and very accurately collocated views of Earth as well as unobstructed views for solar calibration of the passive instruments. The satellite design meets these challenges by employing a fully customised carbon fibre-based platform with the radar, lidar and startrackers (used for determining the satellite’s attitude) positioned as close together as possible, thereby minimising alignment errors. The satellite is dominated by the large Cloud Profiling Radar (CPR) antenna, which is 2.5 m across. The long trailing solar panel at the rear gives the satellite an overall length of 19 m. The solar panel is made up of five sections and covers an area of 21 sq m and, at the satellite’s low orbital altitude, helps minimise atmospheric drag. EarthCARE will orbit Earth at an altitude of around 393 km. The altitude needs to be as low as possible to optimise the use of the lidar and radar, but not too low where atmospheric drag would impact fuel consumption and the life of the mission. Since global coverage is required, EarthCARE’s orbit is near-polar. It crosses the equator in the early afternoon, providing optimal illumination and minimal sun glint for the passive instruments. The system’s power demand is significant. The two active instruments, the Atmospheric Lidar (ATLID) and the CPR, require 2500 W. The size of the satellite (with solar panel and CPR antenna stowed for launch) and its mass of about 2000 kg plus fuel makes it compatible with both Soyuz and Zenit launchers. language code: en);
definition: The EarthCARE satellite will carry four instruments for observations of clouds and aerosols with four synergistic sensing methodologies. The three-axis stabilised satellite platform was designed to accommodate the four instruments, which need unobstructed and very accurately collocated views of Earth as well as unobstructed views for solar calibration of the passive instruments. The satellite design meets these challenges by employing a fully customised carbon fibre-based platform with the radar, lidar and startrackers (used for determining the satellite’s attitude) positioned as close together as possible, thereby minimising alignment errors. The satellite is dominated by the large Cloud Profiling Radar (CPR) antenna, which is 2.5 m across. The long trailing solar panel at the rear gives the satellite an overall length of 19 m. The solar panel is made up of five sections and covers an area of 21 sq m and, at the satellite’s low orbital altitude, helps minimise atmospheric drag. EarthCARE will orbit Earth at an altitude of around 393 km. The altitude needs to be as low as possible to optimise the use of the lidar and radar, but not too low where atmospheric drag would impact fuel consumption and the life of the mission. Since global coverage is required, EarthCARE’s orbit is near-polar. It crosses the equator in the early afternoon, providing optimal illumination and minimal sun glint for the passive instruments. The system’s power demand is significant. The two active instruments, the Atmospheric Lidar (ATLID) and the CPR, require 2500 W. The size of the satellite (with solar panel and CPR antenna stowed for launch) and its mass of about 2000 kg plus fuel makes it compatible with both Soyuz and Zenit launchers.
in scheme: platforms