Chemical Meters/Analyzers
type: Concept

PILS
type: Concept
change note: 2020-07-20 09:36:35.0 [tstevens] insert AltLabel (id: null category: primary text: Particle Into Liquid Sampler language code: en); insert Definition (id: null text: The Particle Into Liquid Sampler (PILS) was developed for rapid automated on-line and continuous measurement of ambient aerosol bulk composition. The general approach is based on earlier devices in which ambient particles are mixed with saturated water vapor to produce droplets easily collected by inertial techniques. The resulting liquid stream is analyzed with an ion chromatograph to quantitatively measure the bulk aerosol ionic components. In this instrument, a modified version of a particle size magnifier is employed to activate and grow particles comprising the fine aerosol mass. A single jet inertial impactor is used to collect the droplets onto a vertical glass plate that is continually washed with a constant water diluent flow of nominally 0.10 ml min-1. The flow is divided and then analyzed by a dual channel ion chromatograph. In its current form, 4.3 min integrated samples were measured every 7 min. The instrument provides bulk composition measurements with a detection limit of approximately 0.1 µg m-3 for chloride, nitrate, sulfate, sodium, ammonium, calcium, and potassium. language code: en);
change note: 2020-07-20 09:32:40.0 [tstevens] Insert Concept add broader relation (PILS [bfaf8b81-6ef6-49d3-bb38-8062985158a2,560540] - Chemical Meters/Analyzers [3d25724b-832f-4a61-b0b2-4f2ccecdba94,543779]);
definition: The Particle Into Liquid Sampler (PILS) was developed for rapid automated on-line and continuous measurement of ambient aerosol bulk composition. The general approach is based on earlier devices in which ambient particles are mixed with saturated water vapor to produce droplets easily collected by inertial techniques. The resulting liquid stream is analyzed with an ion chromatograph to quantitatively measure the bulk aerosol ionic components. In this instrument, a modified version of a particle size magnifier is employed to activate and grow particles comprising the fine aerosol mass. A single jet inertial impactor is used to collect the droplets onto a vertical glass plate that is continually washed with a constant water diluent flow of nominally 0.10 ml min-1. The flow is divided and then analyzed by a dual channel ion chromatograph. In its current form, 4.3 min integrated samples were measured every 7 min. The instrument provides bulk composition measurements with a detection limit of approximately 0.1 µg m-3 for chloride, nitrate, sulfate, sodium, ammonium, calcium, and potassium.
in scheme: instruments