ICATS
type: Concept
change note: 2017-09-14 15:14:26.0 [sritz] insert AltLabel (id: null category: primary text: Information Collection and Transmission System language code: en); insert Definition (id: null text: The Information Collection and Transmission System (ICATS) processes and archives avionics and environmental parameters from the Navigational Management System, GPS, Central Air Data Computer, Embedded GPS/INS, and analog voltage sources from the DC-8 aircraft and experimenters. They include measurements of aircraft parameters, such as air speed, altitude, roll/pitch/yaw angles, flight level wind speed, and temperature. language code: en);
change note: 2017-09-14 15:13:01.0 [sritz] Insert Concept add broader relation (ICATS [c00e5c26-4a6b-4e1a-90fe-2e6e9625724f,310187] - Recorders/Loggers [ebfff02c-2e5a-476e-aafb-c00167bf2daa,291639]);
definition: The Information Collection and Transmission System (ICATS) processes and archives avionics and environmental parameters from the Navigational Management System, GPS, Central Air Data Computer, Embedded GPS/INS, and analog voltage sources from the DC-8 aircraft and experimenters. They include measurements of aircraft parameters, such as air speed, altitude, roll/pitch/yaw angles, flight level wind speed, and temperature.
in scheme: instruments

Recorders/Loggers
type: Concept