OBDH
type: Concept
definition: [Source: Encyclopedia Astronautica, http://www.astronautix.com/ ] The (GRACE) On-Board Data Handling (OBDH) System provided processor and software resources, as well as necessary I/O capabilities for AOCS, Power and Thermal Systems operations, including necessary fault detection, isolation and recovery operations. Group: Instrument_Details Entry_ID: OBDH Group: Instrument_Identification Instrument_Category: In Situ/Laboratory Instruments Instrument_Class: Recorders/Loggers Short_Name: OBDH Long_Name: OnBoard Data Handling System End_Group Group: Associated_Platforms Short_Name: GRACE End_Group Online_Resource: http://www.astronautix.com/craft/grace.htm Creation_Date: 2007-05-02 Group: Instrument_Logistics Instrument_Owner: USA/NASA End_Group End_Group
in scheme: instruments

Recorders/Loggers
type: Concept