ENVIRONMENTAL IMPACTS
type: Concept

PRESCRIBED BURNS/FIRES
type: Concept
change note: 2012-06-29 14:48:02.0 [tbs1979] insert Definition (id: null text: Fire applied in a knowledgeable manner to forest fuels on a specific land area under selected weather conditions to accomplish predetermined, well-defined management objectives. language code: en);
change note: 2012-06-27 14:00:45.0 [tbs1979] Insert Concept add broader relation (PRESCRIBED BURNS/FIRES [c0fb4215-4f72-445f-af81-b3f44c44cd0e,40209] - ENVIRONMENTAL IMPACTS [3f4cfc81-7745-43d9-b313-f68cdf72359b,20271]);
definition: Fire applied in a knowledgeable manner to forest fuels on a specific land area under selected weather conditions to accomplish predetermined, well-defined management objectives.
in scheme: sciencekeywords