M - O
type: Concept

MAGNET
type: Concept
definition: Project Magnet involves data from low altitude, high density individual track line surveys, high altitude vector data and regional magnetic anomaly grids. From 1951 through 1994, the U.S. Navy, under its Project Magnet program, continuously collected vector aeromagnetic survey data to support the U.S. Defense Mapping Agency's world magnetic modeling and charting program. For more information, link to "http://www.ngdc.noaa.gov/seg/potfld/proj_mag.shtml" [Summary provided by NGDC]
in scheme: projects