ACADEMIC
type: Concept

UDEL/RDMS
type: Concept
definition: Research & Data Management Services supports research at the University of Delaware and State agencies by providing access to databases essential to scholarly research, policy formation, information infrastructure, development, and economic growth. Consulting services include assistance with data analysis, data extraction, statistical and mathematical software, geographic information systems, and scientific visualization software. Website: http://www.rdms.udel.edu/ [Summary provided by the University of Delaware.]
in scheme: providers