REFLECTANCE
type: Concept

TOP OF ATMOSPHERE (TOA) REFLECTANCE
type: Concept
change note: 2021-03-03 09:08:46.0 [tstevens] insert Definition (id: null text: Measurement across the solar irradiance spectrum and not a particular band or wavelength in general, but in practice it's based on the particular bands of the sensor. Example: Generating TOA Reflectance for band 1, band 2, etc. The keyword doesn't inherently cover a set wavelength or band. language code: en);
change note: 2021-02-26 12:45:01.0 [tstevens] update PrefLabel (TOP OF ATMOSPHERE (TOA) REFLECTANCE);
change note: 2021-02-26 12:44:07.0 [tstevens] Insert Concept add broader relation (TOP OF ATMOSPHERE _TOA_ REFLECTANCE [c1cb99a3-67a4-4ad8-855a-e98a1e0b23ac,560880] - REFLECTANCE [bdfd401f-7eed-4a48-bd6f-f0c2a890594a,84891]);
definition: Measurement across the solar irradiance spectrum and not a particular band or wavelength in general, but in practice it's based on the particular bands of the sensor. Example: Generating TOA Reflectance for band 1, band 2, etc. The keyword doesn't inherently cover a set wavelength or band.
in scheme: sciencekeywords