Photon/Optical Detectors
type: Concept

TLS
type: Concept
change note: 2018-07-20 12:33:16.0 [sritz] update Definition (The RIEGL VZ-1000 V-Line Terrestrial Laser Scanner provides high speed, non-contact data acquisition using a narrow infrared laser beam and a fast scanning mechanism. More information: https://www.3dlasermapping.com/wp-content/uploads/2017/10/DataSheet_VZ-1000_2017-06-14.pdf);
change note: 2018-07-20 12:26:09.0 [sritz] insert AltLabel (id: null category: primary text: Terrestrial Laser Scanner language code: en);
change note: 2018-07-20 12:30:30.0 [sritz] insert Definition (id: null text: The 3D Laser Scanner RIEGL VZ-100 provides a measurement range of more than 1,400 m, 5mm repeatability and an efficient measurement rate up to 122,000 measurements/sec. More information: https://www.3dlasermapping.com/wp-content/uploads/2017/10/DataSheet_VZ-1000_2017-06-14.pdf language code: en);
change note: 2018-07-20 12:25:34.0 [sritz] Insert Concept add broader relation (TLS [c41e423b-6343-4380-9b6b-e74b2a8485ba,367863] - Photon/Optical Detectors [8143e95e-a438-4a2a-82b2-6d7ae079fba7,347785]);
definition: The RIEGL VZ-1000 V-Line Terrestrial Laser Scanner provides high speed, non-contact data acquisition using a narrow infrared laser beam and a fast scanning mechanism. More information: https://www.3dlasermapping.com/wp-content/uploads/2017/10/DataSheet_VZ-1000_2017-06-14.pdf
in scheme: instruments