EPA
type: Concept

EPA/NCCT
type: Concept
change note: 2013-12-09 02:28:43.0 [sgrebas] insert AltLabel (id: null text: National Center for Computational Toxicology, U.S. Environmental Protection Agency language code: en); update PrefLabel (EPA/NCCT);
change note: 2013-12-09 02:26:08.0 [sgrebas] Insert Concept add broader relation (NCCT [c5a56f31-b74e-4672-89f2-582ec920b583,105981] - EPA [782baf09-4a51-4245-b913-40008bde17dd,66459]);
definition: The National Center for Computational Toxicology (NCCT) is the largest component of EPA's Computational Toxicology Research Program. It was established in 2005 to coordinate computational toxicology research on chemical screening and prioritization, informatics and systems modeling. NCCT is involved in the following areas: -Applies mathematical and advanced computer models to help assess chemical hazards and risks to human health and the environment. -Uses advances in informatics, high-throughput screening technologies and systems biology to develop robust and flexible computational tools that can screen the thousands of chemicals for potential toxicity. -Actively seeks partnerships with other government entities, private industries, academia and non-governmental organizations that provide chemicals, screening data, software and various chemical screening platforms to advance this research. -Works closely with EPA's offices, regions and other research labs. -Has staff with a wide-range of expertise including systems biology, engineering, toxicology, physics, statistics, biology, computational chemistry, bioinformatics, management and public affairs. [Summary provided by NCCT.]
in scheme: providers