FLUVIAL LANDFORMS
type: Concept

OX-BOW LAKE
type: Concept
change note: 2013-08-15 12:56:42.0 [tbs1979] insert Definition (id: null text: U-shaped body of water formed when a wide meander from the main stem of a river is cut off to create a lake. language code: en);
change note: 2013-08-05 12:36:40.0 [tbs1979] Insert Concept add broader relation (OX-BOW LAKE [c5a9eb49-93c4-4fb5-9a02-5fa06ea8800f,105323] - FLUVIAL LANDFORMS [bdc0bd86-a3a3-48fa-b1fb-4ca5d13d4dde,105281]);
definition: U-shaped body of water formed when a wide meander from the main stem of a river is cut off to create a lake.
in scheme: sciencekeywords