COASTAL LANDFORMS
type: Concept

SOUNDS
type: Concept
change note: 2013-03-29 11:04:41.0 [tbs1979] insert Definition (id: null text: A wide inlet of the sea or ocean that is parallel to the coastline; it often separates a coastline from a nearby island language code: en);
change note: 2013-02-18 14:21:25.0 [tbs1979] Insert Concept add broader relation (SOUNDS [c5b85924-9e3f-4106-b389-1ab4486bd233,82619] - COASTAL LANDFORMS [c58320e6-3f1d-4c36-9bee-6bad73404c21,62739]);
definition: A wide inlet of the sea or ocean that is parallel to the coastline; it often separates a coastline from a nearby island
in scheme: sciencekeywords