COASTAL PROCESSES
type: Concept

LAGOONS
type: Concept
definition: A shallow body of seawater generally isolated from the ocean by a barrier island or coral reef, or enclosed within an atoll.
in scheme: sciencekeywords