AGRICULTURAL PLANT SCIENCE
type: Concept

RECLAMATION/REVEGETATION/RESTORATION
type: Concept
definition: Reclamation, as used here refers, to putting a natural resource to a new or altered use. Restoration is the return of an ecosystem to a close approximation of its condition prior to disturbance. Revegetation is the planting of vegetation in an area where vegetation has been removed.
in scheme: sciencekeywords