CONSORTIA/INSTITUTIONS
type: Concept

FRG
type: Concept
definition: The Fox River Group (FRG) is a coalition of six companies that have joined together to identify and evaluate methods to enhance the natural restoration already occurring on the lower Fox River in Northeastern Wisconsin. The FRG companies are committed to working with local, state and federal government agencies to use the best available science to understand and address environmental issues on the Fox River, while preserving the continued economic health of the Fox Cities area. Website: "http://www.foxrivergroup.org/" [Summary provided by The Fox River Group.]
in scheme: providers