DATA PROCESSING SERVICES
type: Concept

DATA ALIGNMENT SERVICES
type: Concept
definition: Service that adjusts sensor geometry models to improve the match of a coverage (or image) with other coverages and/or known ground positions.
in scheme: sciencekeywords