MULTINATIONAL ORGANIZATIONS
type: Concept

EU/C3S
type: Concept
change note: 2019-05-20 05:23:51.0 [mmorahan] Insert Concept add broader relation (EU/C3S [c894c4eb-a1e1-4726-980f-85800666a6af,368829] - MULTINATIONAL ORGANIZATIONS [756a90f8-4203-46f1-87e9-9e0d64bdee50,337169]);
change note: 2019-05-20 05:28:30.0 [mmorahan] insert AltLabel (id: null category: primary text: Copernicus Climate Change Service language code: en); insert Definition (id: null text: The Copernicus Climate Change Service (C3S) supports society by providing authoritative information about the past, present and future climate in Europe and the rest of the World. Our mission: The C3S mission is to support adaptation and mitigation policies of the European Union by providing consistent and authoritative information about climate change. We offer free and open access to climate data and tools based on the best available science. We listen to our users and endeavour to help them meet their goals in dealing with the impacts of climate change. language code: en); insert Resource (id: null type: provider url: https://climate.copernicus.eu/);
definition: The Copernicus Climate Change Service (C3S) supports society by providing authoritative information about the past, present and future climate in Europe and the rest of the World. Our mission: The C3S mission is to support adaptation and mitigation policies of the European Union by providing consistent and authoritative information about climate change. We offer free and open access to climate data and tools based on the best available science. We listen to our users and endeavour to help them meet their goals in dealing with the impacts of climate change.
in scheme: providers