IT/SCAMILLOFORLANINI
type: Concept
definition: n Bologna, under EXPOSANITA '2008, XVI International exhibition at the service of health and health care, and SIT TELEMEDitalia organize, Friday May 30 the third stage of the Roadmap Italian telemedicine and Saturday, May 31 the third Telemedicine Workshop. Summary Provided By: http://translate.google.com/translate?hl=en&sl=it&u=http://www.telemeditalia.it/index.php%3Foption%3Dcom_content%26task%3Dview%26id%3D109%26Itemid%3D0&sa=X&oi=translate&resnum=3&ct=result&prev=/search%3Fq%3D%2BAzienda%2BOspedaliera%2BSan%2BCamillo-Forlanini,%2BRoma,%2BU.O%2BTelemedicina%26hl%3Den%26safe%3Doff%26sa%3DG
in scheme: providers

ITALY
type: Concept