SNOW/ICE
type: Concept

SNOW COVER
type: Concept
change note: 2021-08-30 14:56:40.0 [tstevens] update Definition (Goudie, Andrew. 1997. The Encyclopedic Dictionary of Physical Geography. Blackwell Publishing, Malden, Massachusetts.);
definition: Pertaining to the extent, depth, and longevity of snow pack.
in scheme: sciencekeywords