KARST LANDFORMS
type: Concept

KARST VALLEY
type: Concept
change note: 2013-08-20 10:33:42.0 [tbs1979] insert Definition (id: null text: A valley-scale, mid-size, closed depression otherwise meeting the definition of a sinkhole but also enclosing more than one smaller sinkhole and sinking stream. language code: en);
change note: 2013-08-05 14:18:40.0 [tbs1979] Insert Concept add broader relation (KARST VALLEY [c9323363-ea07-479d-8b64-e3dbf298a7c5,105467] - KARST LANDFORMS [590aa85e-bbce-40b2-8ffb-53d80a61c51a,105289]);
definition: A valley-scale, mid-size, closed depression otherwise meeting the definition of a sinkhole but also enclosing more than one smaller sinkhole and sinking stream.
in scheme: sciencekeywords