Surface
type: Concept

R/V TANGAROA
type: Concept
change note: 2021-11-18 09:21:51.0 [tstevens] Move Concepts delete broader relation (null); add broader relation (R/V TANGAROA [c99251bf-e937-4d59-8899-54d7b71a5667,826733] - Surface [59b97a6c-385e-40a2-8422-ecbdb6023c4c,835900]);
definition: RV Tangaroa is a deepwater research vessel that has been recently upgraded to enhance its ocean science and oil and gas exploration capabilities and extend its useable life. Key details are available at http://www.niwa.co.nz/our-science/vessels/tangaroa/specifications-and-principal-features#key-details. Group: Platform_Details Entry_ID: R/V TANGAROA Group: Platform_Identification Platform_Category: In Situ Ocean-based Platforms Platform_Series_or_Entity: SHIPS Short_Name: R/V TANGAROA End_Group Creation_Date: 2012-07-18 Online_Resource: http://www.niwa.co.nz/our-science/vessels/tangaroa End_Group
in scheme: platforms