AEROSOLS
type: Concept

SULFATE PARTICLES
type: Concept
definition: Atmospheric aerosol particles derived from biogenic or anthropogenic sulfur emissions; comprised of sulfate compounds (e.g., DMS, sulfuric acid, ammonium sulfate).
in scheme: sciencekeywords