Temperature/Humidity Sensors
type: Concept

HUMIDITY TRANSDUCERS
type: Concept
definition: HUMIDITY TRANSDUCERS are electrical devices that converts one form of energy into another, in this case it converts humidity or some measure of the water vapor content of air.
in scheme: instruments