ACADEMIC
type: Concept

UWA/SEFS
type: Concept
change note: 2022-01-14 11:27:57.0 [sritz] Insert Concept add broader relation (UWA/SEFS [cb25895d-c1aa-4cc6-b93f-3e870dec557c,836023] - ACADEMIC [7700280b-68ee-4644-bf5e-84e7a6adf897,822208]);
definition: The School of Environmental and Forest Sciences (SEFS) was established in 1907 as one of the oldest units on the University of Washington campus—and one of the original natural resource programs in the country.
in scheme: providers