PALEOCLIMATE RECONSTRUCTIONS
type: Concept

AIR TEMPERATURE RECONSTRUCTION
type: Concept
definition: Reconstruction of past air temperatures using paleoclimate proxy records.
in scheme: sciencekeywords