CONSORTIA/INSTITUTIONS
type: Concept

PDC
type: Concept
definition: The Pacific Disaster Center's mission is to provide applied information research and analysis support for the development of more effective policies, institutions, programs and information products for the disaster management and humanitarian assistance communities worldwide. Summary Provided By: Pacific Disaster Center http://www.pdc.org/
in scheme: providers