SWEDEN
type: Concept

SE/SGU
type: Concept
definition: The Geological Survey of Sweden (SGU) is the central government agency responsible for questions relating to soil, bedrock and groundwater in Sweden. Since its creation in 1858, SGU has in various ways provided the geological information which society needs. This year we are celebrating our 150th anniversary. Summary Provided By: http://www.sgu.se/sgu/eng/index.html
in scheme: providers