Geostationary Operational Environmental Satellite (GOES)
type: Concept

GOES-12
type: Concept
change note: 2017-09-01 12:53:20.0 [sritz] insert Definition (id: null text: OES-12 (GOES-M) was launched July 23, 2001 from Cape Canaveral Air Station. On Tuesday April 1, 2003 at approximately 1815 UTC, GOES-12 replaced GOES-8 as the operational GOES East Satellite. The spacecraft will perform long term geostationary monitoring of U.S. weather. GOES 12's mission is the monitoring of hurricanes, severe thunderstorms, flash floods, and other severe weather as well as providing short-term weather forecasting or nowcasting. Combined with Doppler radar and automated surface weather stations, real-time GOES data greatly aids weather foecasters in providing better warnings of severe weather. NOAA's National Environmental Satellite, Data, and Information Service will operate GOES. The instrument package includes a GOES I-M Imager and GOES I-M Sounder. language code: en);
change note: 2017-09-01 12:46:52.0 [sritz] Insert Concept add broader relation (GOES-12 [ccc4869c-ff0c-41ef-b621-eaeae1ffb79b,310119] - GOES [6e332c25-caeb-4917-afb6-af757bcecd72,310071]);
definition: OES-12 (GOES-M) was launched July 23, 2001 from Cape Canaveral Air Station. On Tuesday April 1, 2003 at approximately 1815 UTC, GOES-12 replaced GOES-8 as the operational GOES East Satellite. The spacecraft will perform long term geostationary monitoring of U.S. weather. GOES 12's mission is the monitoring of hurricanes, severe thunderstorms, flash floods, and other severe weather as well as providing short-term weather forecasting or nowcasting. Combined with Doppler radar and automated surface weather stations, real-time GOES data greatly aids weather foecasters in providing better warnings of severe weather. NOAA's National Environmental Satellite, Data, and Information Service will operate GOES. The instrument package includes a GOES I-M Imager and GOES I-M Sounder.
in scheme: platforms