COASTAL PROCESSES
type: Concept

LONGSHORE CURRENTS
type: Concept
definition: A current running parallel to shore in the surf zone, caused by the incomplete refraction of waves approaching the beach at an angle.
in scheme: sciencekeywords