A - C
type: Concept

AGLANDS
type: Concept
change note: 2017-09-11 08:16:55.0 [tstevens] update AltLabel (Global Agricultural Lands ); update Definition (Purpose: To provide data on the extent of croplands for research on human-environment interactions. Abstract: The Global Croplands data set represents the proportion of land areas used as cropland (land used for the cultivation of food) in the year 2000. Satellite data from Modetate Resolution Imaging Spectroradiometer (MODIS) and Satellite Pour l'Observation de la Terre (SPOT) Image Vegetation sensor were combined with agricultural inventory data to create a global data set. The visual presentation of this data demonstrates the extent to which human land use for agriculture has changed the Earth and in which areas this change is most intense. The data was compiled by Navin Ramankutty , et. al. (2008) and distributed by the Columbia University Center for International Earth Science Information Network (CIESIN).);
definition: Purpose: To provide data on the extent of croplands for research on human-environment interactions. Abstract: The Global Croplands data set represents the proportion of land areas used as cropland (land used for the cultivation of food) in the year 2000. Satellite data from Modetate Resolution Imaging Spectroradiometer (MODIS) and Satellite Pour l'Observation de la Terre (SPOT) Image Vegetation sensor were combined with agricultural inventory data to create a global data set. The visual presentation of this data demonstrates the extent to which human land use for agriculture has changed the Earth and in which areas this change is most intense. The data was compiled by Navin Ramankutty , et. al. (2008) and distributed by the Columbia University Center for International Earth Science Information Network (CIESIN).
in scheme: projects