SPECIES/POPULATION INTERACTIONS
type: Concept

INDIGENOUS/NATIVE SPECIES
type: Concept
definition: Indigenous Species or native species is a term applied to a species that occurs naturally in an area, and therefore, one that has not been introduced by humans accidentally or intentionally.
in scheme: sciencekeywords