INFORMATION MANAGEMENT SERVICES
type: Concept

WEB MAP SERVICE
type: Concept
definition: Dynamically produces spatially referenced map of client-specified ground rectangle from one or more client-selected geographic datasets, returning pre-defined pictorial renderings of maps in an image or graphics format.
in scheme: sciencekeywords