HUMIDITY INDICES
type: Concept

HUMIDITY INDEX
type: Concept
definition: The Humidity Index is based on a ratio of annual precipitation and potential evapotranspiration There are various humidity indices including: The Global Humidity Index Evaporative Cooling Humidity Index Heat-Humidity Index
in scheme: sciencekeywords